دوقلوزایی
preferred label: twinning @en
type: Concept
narrower: دوقلوی دگرشکلی

دوقلوی دگرشکلی
scope note: بلوری دوقلویی که در نتیجۀ دگرشکلی در بلور قبلی به وجود می‌آید
broader: دوقلوزایی
preferred label: deformation twin @en
type: Concept