ناحیه مندوکینو کالیفرنیا
preferred label: Mendocino County California @en
type: Concept
related: دماغه آرنا

دماغه آرنا
scope note: یک دماغه بلند در اقیانوس آرام در شمال غرب کالیفرنیا
related: ناحیه مندوکینو کالیفرنیا
preferred label: Point Arena @en
type: Concept