دگرگونی دینامیکی ـ گرمایی
scope note: نوعی دگرگونی با دامنۀ فشار ـ دمای وسیع که در آن فشار و تنش برشی جهت‏یافته نقش مؤثری دارد
broader: دگرگونی
preferred label: dynamothermal metamorphism @en
type: Concept

دگرگونی
preferred label: metamorphism @en
type: Concept
narrower: دگرگونی دینامیکی ـ گرمایی