فرادگرگونی
scope note: فرایندهای دگرگونی که در بالاترین حد دما و فشار رخ می‌دهند
broader: دگرگونی
preferred label: ultrametamorphism @en
type: Concept

دگرگونی
preferred label: metamorphism @en
type: Concept
narrower: فرادگرگونی