دشت گدازه
scope note: زمینی مسطح و وسیع که بستر آن از توالی نسبتاً نازک جریان گدازه تشکیل شده و معمولاً بازالتی و ناشی از فوران شکافه‌ای است
related: دشت
related: گدازه
preferred label: lava plain @en
type: Concept

گدازه
preferred label: lava @en
type: Concept
related: دشت گدازه

دشت
preferred label: plain @en
type: Concept
related: دشت گدازه