دریاچه پیرامید
scope note: دریاچه ای در ناحیه واشو، شمال غرب نوادا. ضمناً در محلهای دیگر نیز واقع شده است
related: ناحیه واشوی نوادا
preferred label: Pyramid Lake @en
type: Concept

ناحیه واشوی نوادا
preferred label: Washoe County Nevada @en
type: Concept
related: دریاچه پیرامید