ناحیه ریچ یوتا
preferred label: Rich County Utah @en
type: Concept
related: دریاچه بیر

دریاچه بیر
scope note: شمال اوتاه و ناحیه دریاچه بیر، جنوب شرق ایداهو. ممکن است در مناطق دیگر هم باشد.
related: ناحیه ریچ یوتا
preferred label: Bear Lake @en
type: Concept