دریاچه
preferred label: lake @en
type: Concept
narrower: دریاچه غول‌دهانه

دریاچه غول‌دهانه
scope note: دریاچه‌ای، معمولاً دریاچۀ آب شیرین، که در غول‌دهانه براثر انباشت آب باران یا ذوب برف به وجود می‌آید
broader: دریاچه
preferred label: caldera lake @en
type: Concept