کالیفرنیا
preferred label: California @en
type: Concept
related: دره ساکرامنتو

دره ساکرامنتو
scope note: دره رودخانه‌ای. نیمه شمالی دره مرکزی. از لیک شاستا تا دره سان جوکین
related: دره مرکزی
related: کالیفرنیا
preferred label: Sacramento Valley @en
type: Concept

دره مرکزی
preferred label: Central Valley @en
type: Concept
related: دره ساکرامنتو