دره رورینگ بروک
scope note: دره‌ای در ناحیه هارتفورد و دیگری در ناحیه تالند، کانکتیکوت. ضمناً ممکن است در آدیرونداک شمال شرق نیویورک و محلهای دیگر نیز واقع شده باشد
related: ناحیه هارتفورد کانکتیکوت
related: نیویورک
preferred label: Roaring Brook Valley @en
type: Concept

نیویورک
preferred label: New York @en
type: Concept
related: دره رورینگ بروک

ناحیه هارتفورد کانکتیکوت
preferred label: Hartford County connecticut @en
type: Concept
related: دره رورینگ بروک