کانی
preferred label: mineral @en
type: Concept
related: دروغین ریختی

دروغین ریختی
scope note: تغییر شکل تدریجی یک کانی به اشکال دیگر که ویژه کانی‌های نوع دیگر است. بویژه کانیهای بلورین
related: کانی
preferred label: pseudomorphism @en
type: Concept