ویسکونزین
preferred label: Wisconsin @en
type: Concept
related: دانشگاه ویسکونزین

دانشگاه ویسکونزین
scope note: دانشکده‌های علوم زمین در مادیسون، ایوکلایره، گرین بی، وائوسائو (ناحیه ماراتن کامپوس) میلوائوکی، اوشکوش، کنوشا (پارکساید کامپوس)، پلاته‌ویل، ریورفالز، استونس پوینت، سوپریور و وایت واتر قرار دارد
related: مؤسسه دانشگاهی
related: ویسکونزین
preferred label: University of Wisconsin @en
type: Concept

مؤسسه دانشگاهی
preferred label: academic institution @en
type: Concept
related: دانشگاه ویسکونزین