خودریخت
scope note: ویژگی دانه‌ای که دارای وجوه بلوری کامل است
related: نیمه‌خودریخت
preferred label: idiomorphic @en
type: Concept

نیمه‌خودریخت
preferred label: hypidiomorphic @en
type: Concept
related: خودریخت