تگزاس
preferred label: Texas @en
type: Concept
related: خلیج کورپوس کریستی

خلیج کورپوس کریستی
scope note: شاخه فرعی خلیج مکزیک ما بین نواحی نویکس و سان پارتیشیو، جنوب شرق تگزاس.
related: ناحیه نوکس تگزاس
related: تگزاس
preferred label: Corpus Christi Bay @en
type: Concept

ناحیه نوکس تگزاس
preferred label: Nueces County Texas @en
type: Concept
related: خلیج کورپوس کریستی