خطوارگی کانیایی
scope note: سوگیری ترجیحی کانی‌های ناهم‌اندازه یا انبوهۀ دانه‌های کشیده در یک عنصر بافتی خطی
broader: خط‌وارگی
preferred label: mineral lineation @en
type: Concept

خط‌وارگی
preferred label: lineation @en
type: Concept
narrower: خطوارگی کانیایی