خط‌وارگی
preferred label: lineation @en
type: Concept
narrower: خطوارگی کنگره‌ای

خطوارگی کنگره‌ای
scope note: نوعی خطوارگی که ویژگی آن وجود لولاهای چین‌های کوچک یا کنگره‌هایی است که در ایجاد رَخ کنگره‌ای مؤثر هستند
broader: خط‌وارگی
preferred label: crenulation lineation @en
type: Concept