خزش
preferred label: creep @en
type: Concept
narrower: خزش گذرا

خزش گذرا
scope note: تغییر آرام در سنگ‌ها که تحت تأثیر شرایط دمایی و فشاری محیطی در سطح یا نزدیک به سطح زمین به وجود می‌آید
broader: خزش
preferred label: transient creep @en
type: Concept