خاکریز گدازه
scope note: ورقه‌های سنگ‌پایی از گدازه که بر روی مسیرهای طبیعی خود جریان یافته و خاکریزی جامد به وجود می‌آورد
related: گدازه
preferred label: lava levee @en
type: Concept

گدازه
preferred label: lava @en
type: Concept
related: خاکریز گدازه