حوضه مرکزی
scope note: مرکز تنسی. ضمناً شاید در مناطق دیگر نیز واقع شود.
related: تنسی
preferred label: Central Basin @en
type: Concept

تنسی
preferred label: Tennessee @en
type: Concept
related: حوضه مرکزی