ناحیه تیلور تگزاس
preferred label: Taylor County Texas @en
type: Concept
related: حوضه سیلو

حوضه سیلو
scope note: در ناحیه لارامی، جنوب غرب ویومینگ. همچنین درناحیه تیلور، تگزاس
related: ناحیه تیلور تگزاس
related: میدان نفت و گاز
preferred label: Silo Field @en
type: Concept

میدان نفت و گاز
preferred label: oil and gas field @en
type: Concept
related: حوضه سیلو