حوضه پرت
scope note: در طول اقیانوس هند در استرالیای غربی، از ناحیه پرت در جنوب تا حوضه کاماروون در شمال
related: پِرت استرالیا
preferred label: Perth Basin @en
type: Concept

پِرت استرالیا
preferred label: Perth Australia @en
type: Concept
related: حوضه پرت