ذخیره معدنی
preferred label: mineral deposit @en
type: Concept
related: چینه‌سان

چینه‌سان
scope note: ویژگی ذخایر معدنی لایه‌ای با منشأ آذرین یا رسوبی که به‌صورت نوارها یا لایه‌ها یا ورقه‌های موازی از سنگ یا کان‌سنگ تشکیل شده است
related: ذخیره معدنی
related: چینه‌شناسی
preferred label: stratiform @en
type: Concept

چینه‌شناسی
preferred label: stratigraphy @en
type: Concept
related: چینه‌سان