چین دوشیب‏محور
scope note: چینی که جهت شیب محور آن در منطقه‏ای قابل‌مشاهده معکوس شود
broader: چین(ساختار زمین‌شناسی)
preferred label: doubly plunging fold @en
type: Concept

چین(ساختار زمین‌شناسی)
preferred label: fold @en
type: Concept
narrower: چین دوشیب‏محور