چوب
preferred label: wood @en
type: Concept
related: چوب سیلیسی‌شده

چوب سیلیسی‌شده
scope note: ماده‌ای که براثر سیلیسی ‌شدن چوب به وجود می‌آید
related: چوب
preferred label: silicified wood @en
type: Concept