چندرنگی بازتابشی
scope note: توانایی بلورها در تغییر رنگ در نور قطبیدۀ بازتابیده در هنگام چرخیدن نور
broader: چندرنگی
preferred label: reflection pleochroism @en
type: Concept

چندرنگی
preferred label: pleochroism @en
type: Concept
narrower: چندرنگی بازتابشی