چشمه
preferred label: spring @en
type: Concept
narrower: چشمه شکستگی

شکستگی
preferred label: fracture(structural geology) @en
type: Concept
related: چشمه شکستگی

چشمه شکستگی
scope note: چشمه‏ای که از شکستگی‌های درون یک سنگ خارج می‌شود
related: شکستگی
broader: چشمه
preferred label: fracture spring @en
type: Concept