چرخه
preferred label: cycle @en
type: Concept
related: چرخه آتشفشانی

چرخه آتشفشانی
scope note: توالی منظمی از تغییرات در رفتار یک آتشفشان
related: چرخه
preferred label: volcanic cycle @en
type: Concept