جودوست
scope note: ویژگی عناصری که بیش از همه در جوّ زمین وجود دارند، مانند H, C, N, O, I و گازهای نادر
related: جو
preferred label: atmophile @en
type: Concept

جو
preferred label: atmosphere @en
type: Concept
related: جودوست