خلیج مکزیک
preferred label: Gulf of Mexico @en
type: Concept
related: جزیره های

ناحیه گالوستون تگزاس
preferred label: Galveston County Texas @en
type: Concept
related: جزیره های

جزیره های
scope note: جزیره‌ای در خلیج مکزیک کناره جنوب شرقی ساحل تگزاس. شاید در محل‌های دیگری نیز واقع شده است.
related: ناحیه گالوستون تگزاس
related: خلیج مکزیک
preferred label: High Island @en
type: Concept