جزایر اقیانوس هند
preferred label: Indian Ocean Islands @en
type: Concept
narrower: گروه جزایر پرنس ادوارد

گروه جزایر پرنس ادوارد
scope note: جنوب شرق اقیانوس هند. سرزمین آفریقای جنوبی
broader: جزایر اقیانوس هند
preferred label: Prince Edward Island Group @en
type: Concept