جزیره گوادالوپ
scope note: جزیره مکزیکی که 180 مایل دورتر از مرکز باجا کالیفرنیا است.
broader: جزایر اقیانوس آرام شرقی
preferred label: Guadalupe Island @en
type: Concept

جزایر اقیانوس آرام شرقی
preferred label: East Pacific Ocean Islands @en
type: Concept
narrower: جزیره گوادالوپ