دگرگونی
preferred label: metamorphism @en
type: Concept
related: جریان‌ریختی

جریان‌ریختی
scope note: ذوب شدن سنگهای پیشین در حین عمل گرانیتی و میگماتیتی شدن
related: دگرگونی
preferred label: rheomorphism @en
type: Concept