تلماسه
preferred label: dune @en
type: Concept
narrower: تلماسه متحرک

تلماسه متحرک
scope note: تلماسه‌ای ساحلی که براثر حرکت باد به وجود می‌آید و بخشی از سطح آن فاقد پوشش گیاهی است
broader: تلماسه
preferred label: mobile dune @en
type: Concept