تراوایی
preferred label: permeability @en
type: Concept
narrower: تراوایی ویژه

تراوایی ویژه
scope note: تراوایی بستر یک رود که برابر است با حاصلِ‌ضرب یک عدد ثابت در مربع قطر حفره‏های آن
broader: تراوایی
preferred label: specific permeability @en
type: Concept