تخلخل
preferred label: porosity @en
type: Concept
narrower: تخلخل مؤثر

تخلخل مؤثر
scope note: میزان تخلخل ایجادشده در حجم کل یک سنگ یا خاک توسط فضاهای خالی به‏هم‏پیوسته
broader: تخلخل
preferred label: effective porosity @en
type: Concept