ادنتاتا(راسته فسیلی)
preferred label: Edentata @en
type: Concept
related: تاردیگرادا

تاردیگرادا
scope note: جانوران کوچکی که در خزه‌ها یافت می‌شوند و احتمالاً بندپایان ویژگی یافته هستند.
related: بندپایان
related: ادنتاتا(راسته فسیلی)
preferred label: Tardigrada @en
type: Concept

بندپایان
preferred label: Arthropoda @en
type: Concept
related: تاردیگرادا