پیش‌کرانه
scope note: منطقه‏ای میان بالاترین و پایین‏ترین داغاب دریا
related: پس‌کرانه
preferred label: foreshore @en
type: Concept

پس‌کرانه
preferred label: backshore @en
type: Concept
related: پیش‌کرانه