پیچان‌دره
scope note: دره‌ای با پیچ‌های متوالی شبیه به مسیر پیچان‌رود
related: رودپیچ
preferred label: meandering valley @en
type: Concept

رودپیچ
preferred label: meander @en
type: Concept
related: پیچان‌دره