پوش‌سپهر
scope note: بخشی از اتمسفر زمین که بین تروپوسفرویونوسفر قرار گرفته است.
related: ابر خاکستر
related: جو
preferred label: stratosphere @en
type: Concept

جو
preferred label: atmosphere @en
type: Concept
related: پوش‌سپهر

ابر خاکستر
preferred label: ash cloud @en
type: Concept
related: پوش‌سپهر