استرالیا
preferred label: Australia @en
type: Concept
related: سازند بیتر اسپرینگز

سازند بیتر اسپرینگز
scope note: در زیر آن رسوبات کامبرین میانی و بالای آن کوارتزیت هیویتری. جنوب غرب و جنوب مرکز ایالت شمالی.
related: استرالیا
broader: پروتروزوئیک(دوران)
preferred label: Bitter Springs Formation @en
type: Concept

پروتروزوئیک(دوران)
preferred label: Proterozoic @en
type: Concept
narrower: سازند بیتر اسپرینگز