ساکامارین
scope note: از اشکوب‌های پرمین در اروپا. بالای استفانین (کربونیفر)، زیر آرتینکین
broader: پرمین زیرین
preferred label: Sakmarian @en
type: Concept

پرمین زیرین
preferred label: Lower Permian @en
type: Concept
narrower: ساکامارین