ژدینین
scope note: اروپا.بالای لودلووین(سیلورین)،زیرسیگنین.
broader: دونین زیرین
preferred label: Gedinnian @en
type: Concept

دونین زیرین
preferred label: Lower Devonian @en
type: Concept
narrower: ژدینین