کالیفرنیا
preferred label: California @en
type: Concept
related: ریولیت بالاکلالا

ریولیت بالاکلالا
scope note: شمال کالیفرنیا. با پوششی از بازالت سبز کوپلی و تداخل بین انگشتی با آن در بسیاری از مناطق
related: کالیفرنیا
broader: دونین میانی
preferred label: Balaklala Rhyolite @en
type: Concept

دونین میانی
preferred label: Middle Devonian @en
type: Concept
narrower: ریولیت بالاکلالا