ورمونت
preferred label: Vermont @en
type: Concept
related: گرانیت باره

دونین
preferred label: Devonian @en
type: Concept
narrower: گرانیت باره

گرانیت باره
scope note: توده کشیده شده و بیضی شکل که در بخشهای شمال غرب و غرب مرکز شرق چهارگوش بار، ناحیه واشنگتن، ورمونت رخنمون دارد.
related: ورمونت
broader: دونین
preferred label: Barre Granite @en
type: Concept