سازند سمینول
scope note: در گروه اسکیاتوک. شمال شرق، مرکز و مرکز جنوب اوکلاهما
related: اوکلاهما
broader: میسورین
preferred label: Seminole Formation @en
type: Concept

اوکلاهما
preferred label: Oklahoma @en
type: Concept
related: سازند سمینول

میسورین
preferred label: Missourian @en
type: Concept
narrower: سازند سمینول