گرانیت پترزبورگ
scope note: پالئوزوئیک(دوران) پسین. در زیر رسوبات تریاسی قرار دارد. شرق ویرجینیا
related: ویرجینیا
broader: پالئوزوئیک(دوران)
preferred label: Petersburg Granite @en
type: Concept

پالئوزوئیک(دوران)
preferred label: Paleozoic @en
type: Concept
narrower: گرانیت پترزبورگ

ویرجینیا
preferred label: Virginia @en
type: Concept
related: گرانیت پترزبورگ