پادگانه
preferred label: terrace @en
type: Concept
narrower: پادگانۀ زمین‏لغزه‏ای

پادگانۀ زمین‏لغزه‏ای
scope note: پادگانه‏ای کوتاه با سطحی ناهموار که براثر زمین‏لغزه ایجاد می‌شود
broader: پادگانه
preferred label: landslide terrace @en
type: Concept