پادگانه
preferred label: terrace @en
type: Concept
narrower: پادگانۀ فرسایشی

پادگانۀ فرسایشی
scope note: پادگانه‏ای که در نتیجۀ فرسایش در کنار دیوارۀ درّه‌های رودخانه‏ای به وجود می‌آید
broader: پادگانه
preferred label: erosion terrace @en
type: Concept