اکینوزوا
preferred label: Echinozoa @en
type: Concept
narrower: اکینوئیدآ

اکینوئیدآ
scope note: رده ای از خارپوستان که شامل توتیای دریایی می باشد. شکل آنها کم و بیش کروی است و صفحات استخوانی در سطح بدن به یکدیگر پیوسته و اسکلت سختی را بوجود آورده اند.
broader: اکینوزوا
preferred label: Echinoidea @en
type: Concept