اینوسراموس
scope note: از دوکفه‌ای‌های دریایی بوده، صدف آن‌ها لایه‌ای از منشورهای کوچک کلسیت را به وجود می‌آورد که کم و بیش آثار آن‌ها را به طور پراکنده در رسوبات دریایی می‌توان مشاهده کرد. در رسوبات ژوراسیک تا کرتاسه مشاهده می‌شوند.
broader: اینوسرامیدا
preferred label: Inoceramus @en
type: Concept

اینوسرامیدا
preferred label: Inoceramidae @en
type: Concept
narrower: اینوسراموس